Quantcast
Channel: VMware Communities : All Content - vRealize Automation Tools
Viewing all articles
Browse latest Browse all 9859

vCAC 5.2 Install failure

$
0
0

Greetings !

 

I'm unable to install vcac 5.2, it fails during model manager installation. Logs does not really tell what is wrong, I have done this several times before and never seen it before. Any clues are much appreciated, thank you.

 

Edit: user is local admin, pre-requisite checker is clean.

 

Info : 2014-05-10 04 59 13 994 PM :Microsoft (R) Build Engine version 4.0.30319.17929

Info : 2014-05-10 04 59 14 010 PM :[Microsoft .NET Framework, version 4.0.30319.17929]

Info : 2014-05-10 04 59 14 010 PM :Copyright (C) Microsoft Corporation. All rights reserved.

Info : 2014-05-10 04 59 14 197 PM :Build started 5/10/2014 4:59:14 PM.

Info : 2014-05-10 04 59 14 556 PM :Project "C:\Program Files (x86)\VMware\vCAC\Server\Model Manager Data\DeployRepository.xml" on node 1 (InitializeRepo target(s)).

Info : 2014-05-10 04 59 14 556 PM :InitializeRepo:

Info : 2014-05-10 04 59 14 556 PM :  "C:\Program Files (x86)\VMware\vCAC\Server\Model Manager Data\Reporeg.exe" Install-MetaModel -s "190.193.185.13" -d "vCAC_Dev"   -v

Info : 2014-05-10 04 59 39 142 PM :  System.ArgumentException: Value does not fall within the expected range.

Info : 2014-05-10 04 59 39 142 PM :     at AZROLESLib.IAzAuthorizationStore.Initialize(Int32 lFlags, String bstrPolicyURL, Object varReserved)

Info : 2014-05-10 04 59 39 142 PM :     at DynamicOps.Repository.Runtime.Common.RepositoryRuntime.IsSecurityModelInitialized(String connectionString)

Info : 2014-05-10 04 59 39 142 PM :     at DynamicOps.Tools.Reporeg.Helpers.RepositoryInitializer.Install(String server, String catalog, String userName, String password, String store)

Info : 2014-05-10 04 59 39 142 PM :     at DynamicOps.Tools.Reporeg.Command.InstallCommand.Execute(CommandLineParser parser)

Info : 2014-05-10 04 59 40 780 PM :C:\Program Files (x86)\VMware\vCAC\Server\Model Manager Data\DeployRepository.xml(108,5): error MSB3073: The command ""C:\Program Files (x86)\VMware\vCAC\Server\Model Manager Data\Reporeg.exe" Install-MetaModel -s "190.193.185.13" -d "vCAC_Dev"   -v" exited with code 1.

Info : 2014-05-10 04 59 40 858 PM :Done Building Project "C:\Program Files (x86)\VMware\vCAC\Server\Model Manager Data\DeployRepository.xml" (InitializeRepo target(s)) -- FAILED.

Info : 2014-05-10 04 59 40 858 PM :Build FAILED.

Info : 2014-05-10 04 59 40 858 PM :"C:\Program Files (x86)\VMware\vCAC\Server\Model Manager Data\DeployRepository.xml" (InitializeRepo target) (1) ->

Info : 2014-05-10 04 59 40 858 PM :(InitializeRepo target) ->

Info : 2014-05-10 04 59 40 858 PM :  C:\Program Files (x86)\VMware\vCAC\Server\Model Manager Data\DeployRepository.xml(108,5): error MSB3073: The command ""C:\Program Files (x86)\VMware\vCAC\Server\Model Manager Data\Reporeg.exe" Install-MetaModel -s "190.193.185.13" -d "vCAC_Dev"   -v" exited with code 1.

Info : 2014-05-10 04 59 40 858 PM :    0 Warning(s)

Info : 2014-05-10 04 59 40 858 PM :    1 Error(s)

Info : 2014-05-10 04 59 40 873 PM :Time Elapsed 00:00:26.64

2014-05-10 04 59 40 873 PM :================= Logging stopped at 2014-05-10 04 59 40 873 PM ==================

2014-05-10 04 59 40 873 PM :VMware vCloud Automation Center Server Configuration failed.  Error


Viewing all articles
Browse latest Browse all 9859

Trending Articles



<script src="https://jsc.adskeeper.com/r/s/rssing.com.1596347.js" async> </script>